Target
Histamine H1 receptor
Ligand
BDBM50290726
Substrate
Meas. Tech.
ChEBML_84418
IC50
6±n/a nM
Citation
 Vaz, RJMaynard, GDKudlacz, EMBratton, LDKane, JMShatzer, SAKnippenberg, RW Use of CoMFA in validating the conformation used in designing 4-(1H-benzimidazole-2-carbonyl)piperidines with H1/NK1 receptor antagonist activity Bioorg Med Chem Lett 7:2825-2830 (1997)    Article 
Target
Name:
Histamine H1 receptor
Synonyms:
H1R HISTAMINE H1 HRH1_HUMAN
Type:
G Protein-Coupled Receptor (GPCR)
Mol. Mass.:
55808.72
Organism:
Homo sapiens (Human)
Description:
Cell pellets from SK-N-MC cells transfected with human H1 receptor were used in binding assay.
Residue:
487
  
Inhibitor
Name:
BDBM50290726
Synonyms:
4-[2-(1-{2-[3-(3,4-Dichloro-phenyl)-1-(3,4,5-trimethoxy-benzoyl)-pyrrolidin-3-yl]-ethyl}-piperidine-4-carbonyl)-benzoimidazol-1-yl]-butyric acid ethyl ester | CHEMBL318369
Type:
Small organic molecule
Emp. Form.:
C41H48Cl2N4O7
Mol. Mass.:
779.748
SMILES:
CCOC(=O)CCCn1c(nc2ccccc12)C(=O)C1CCN(CCC2(CCN(C2)C(=O)c2cc(OC)c(OC)c(OC)c2)c2ccc(Cl)c(Cl)c2)CC1
: