Target
Histamine H1 receptor
Ligand
BDBM50290746
Substrate
Meas. Tech.
ChEBML_84418
IC50
5±n/a nM
Citation
 Vaz, RJMaynard, GDKudlacz, EMBratton, LDKane, JMShatzer, SAKnippenberg, RW Use of CoMFA in validating the conformation used in designing 4-(1H-benzimidazole-2-carbonyl)piperidines with H1/NK1 receptor antagonist activity Bioorg Med Chem Lett 7:2825-2830 (1997)    Article 
Target
Name:
Histamine H1 receptor
Synonyms:
H1R HISTAMINE H1 HRH1_HUMAN
Type:
G Protein-Coupled Receptor (GPCR)
Mol. Mass.:
55808.72
Organism:
Homo sapiens (Human)
Description:
Cell pellets from SK-N-MC cells transfected with human H1 receptor were used in binding assay.
Residue:
487
  
Inhibitor
Name:
BDBM50290746
Synonyms:
4-[2-(1-{2-[3-(3,4-Dichloro-phenyl)-1-(3,4,5-trimethoxy-benzoyl)-pyrrolidin-3-yl]-ethyl}-piperidine-4-carbonyl)-benzoimidazol-1-yl]-butyric acid | CHEMBL94788
Type:
Small organic molecule
Emp. Form.:
C39H44Cl2N4O7
Mol. Mass.:
751.695
SMILES:
COc1cc(cc(OC)c1OC)C(=O)N1CCC(CCN2CCC(CC2)C(=O)c2nc3ccccc3n2CCCC(O)=O)(C1)c1ccc(Cl)c(Cl)c1
: