Target
Prothrombin
Ligand
BDBM50291004
Substrate
Meas. Tech.
ChEBML_207963
IC50
1.1±n/a nM
Citation
 Tamura, SYGoldman, EABrunck, TKRipka, WCSemple, JE Rational design, synthesis, and serine protease inhibitory activity of a novel P1-argininal derivative featuring a conformationally constrained P2–P3 bicyclic lactam moiety Bioorg Med Chem Lett 7:331-336 (1997)    Article 
Target
Name:
Prothrombin
Synonyms:
Activation peptide fragment 1 Coagulation factor II Prothrombin precursor Thrombin heavy chain | Thrombin light chain
Type:
Protein
Mol. Mass.:
70029.57
Organism:
Homo sapiens (Human)
Description:
P00734
Residue:
622
  
Inhibitor
Name:
BDBM50291004
Synonyms:
4-[2-(1-Carbamimidoyl-2-hydroxy-piperidin-3-ylcarbamoyl)-pyrrolidin-1-yl]-4-oxo-3-(2-propyl-pentanoylamino)-butyric acid methyl ester | CHEMBL112726
Type:
Small organic molecule
Emp. Form.:
C24H42N6O6
Mol. Mass.:
510.6269
SMILES:
CCCC(CCC)C(=O)N[C@@H](CC(=O)OC)C(=O)N1CCCC1C(=O)N[C@H]1CCCN(C1O)C(N)=N
: