Target
Squalene synthase
Ligand
BDBM50291311
Substrate
Meas. Tech.
ChEBML_202267
Ki
20±n/a nM
Citation
 Brown, GRFoubister, AJFreeman, SMcTaggart, FMirrlees, DJReid, ACSmith, GJTaylor, MJThomason, DAWhittamore, PR Novel optimised quinuclidine squalene synthase inhibitors Bioorg Med Chem Lett 7:597-600 (1997)    Article 
Target
Name:
Squalene synthase
Synonyms:
FDFT_RAT Farnesyl-diphosphate farnesyltransferase SQS Squalene synthetase
Type:
PROTEIN
Mol. Mass.:
48109.41
Organism:
Rattus norvegicus
Description:
ChEMBL_1336736
Residue:
416
  
Inhibitor
Name:
BDBM50291311
Synonyms:
6-[3-Allyl-4-(3-hydroxy-1-aza-bicyclo[2.2.2]oct-3-ylethynyl)-phenyl]-hexanoic acid methyl ester | CHEMBL155574
Type:
Small organic molecule
Emp. Form.:
C25H33NO3
Mol. Mass.:
395.5344
SMILES:
COC(=O)CCCCCc1ccc(C#CC2(O)CN3CCC2CC3)c(CC=C)c1
: