Target
Squalene synthase
Ligand
BDBM50075719
Substrate
Meas. Tech.
ChEBML_201962
Ki
43±n/a nM
Citation
 Brown, GRFoubister, AJFreeman, SMcTaggart, FMirrlees, DJReid, ACSmith, GJTaylor, MJThomason, DAWhittamore, PR Novel optimised quinuclidine squalene synthase inhibitors Bioorg Med Chem Lett 7:597-600 (1997)    Article 
Target
Name:
Squalene synthase
Synonyms:
FDFT1 FPP:FPP farnesyltransferase SQS Squalene synthetase
Type:
PROTEIN
Mol. Mass.:
48114.76
Organism:
Homo sapiens (Human)
Description:
ChEMBL_1352847
Residue:
417
  
Inhibitor
Name:
BDBM50075719
Synonyms:
3-[3-Allyl-4-(3-hydroxy-1-aza-bicyclo[2.2.2]oct-3-ylethynyl)-phenyl]-propionic acid ethyl ester | CHEMBL24362
Type:
Small organic molecule
Emp. Form.:
C23H29NO3
Mol. Mass.:
367.4813
SMILES:
CCOC(=O)CCc1ccc(C#CC2(O)CN3CCC2CC3)c(CC=C)c1
: