Target
Aldehyde dehydrogenase, cytosolic 1
Ligand
BDBM50085551
Substrate
Meas. Tech.
ChEMBL_482174 (CHEMBL960208)
IC50
6000±n/a nM
Citation
 Shin, KHWoo, WSLim, SSShim, CSChung, HSKennelly, EJKinghorn, AD Elgonica-Dimers A and B, Two Potent Alcohol Metabolism Inhibitory Constituents of Aloe arborescens J Nat Prod 60:1180-1182 (1997)    Article 
Target
Name:
Aldehyde dehydrogenase, cytosolic 1
Synonyms:
AL1A7_RAT Aldh1 Aldh1a7
Type:
PROTEIN
Mol. Mass.:
54563.57
Organism:
Rattus norvegicus
Description:
ChEMBL_482174
Residue:
501
  
Inhibitor
Name:
BDBM50085551
Synonyms:
1,8-Dihydroxy-3-hydroxymethyl-anthraquinone CHEMBL40275 aloe-emodin | cid_10207
Type:
Small organic molecule
Emp. Form.:
C15H10O5
Mol. Mass.:
270.2369
SMILES:
OCc1cc(O)c2C(=O)c3c(O)cccc3C(=O)c2c1
: