Target
4,4'-diapophytoene synthase
Ligand
BDBM50292864
Substrate
Meas. Tech.
ChEMBL_494370 (CHEMBL941163)
IC50
2200±n/a nM
Citation
 Song, YLin, FYYin, FHensler, MRodrígues Poveda, CAMukkamala, DCao, RWang, HMorita, CTGonzález Pacanowska, DNizet, VOldfield, E Phosphonosulfonates are potent, selective inhibitors of dehydrosqualene synthase and staphyloxanthin biosynthesis in Staphylococcus aureus. J Med Chem 52:976-88 (2009)  
Target
Name:
4,4'-diapophytoene synthase
Synonyms:
CRTM_STAAU crtM
Type:
PROTEIN
Mol. Mass.:
34309.10
Organism:
Staphylococcus aureus
Description:
ChEMBL_1352846
Residue:
287
  
Inhibitor
Name:
BDBM50292864
Synonyms:
1-Phosphono-4-[3-(3-fluorophenoxy)phenyl]butylsulfonic Acid Tripotassium Salt | CHEMBL473343
Type:
Small organic molecule
Emp. Form.:
C16H15FO7PS
Mol. Mass.:
401.325
SMILES:
[O-]P([O-])(=O)C(CCCc1cccc(Oc2cccc(F)c2)c1)S([O-])(=O)=O
: