Target
4,4'-diapophytoene synthase
Ligand
BDBM50292847
Substrate
Meas. Tech.
ChEMBL_494370 (CHEMBL941163)
IC50
200±n/a nM
Citation
 Song, YLin, FYYin, FHensler, MRodrígues Poveda, CAMukkamala, DCao, RWang, HMorita, CTGonzález Pacanowska, DNizet, VOldfield, E Phosphonosulfonates are potent, selective inhibitors of dehydrosqualene synthase and staphyloxanthin biosynthesis in Staphylococcus aureus. J Med Chem 52:976-88 (2009)  
Target
Name:
4,4'-diapophytoene synthase
Synonyms:
CRTM_STAAU crtM
Type:
PROTEIN
Mol. Mass.:
34309.10
Organism:
Staphylococcus aureus
Description:
ChEMBL_1352846
Residue:
287
  
Inhibitor
Name:
BDBM50292847
Synonyms:
4-[4-(4-Trifluoromethylphenyl)phenyl)]butyldiphosphonic Acid Dipotassium Salt | CHEMBL460896
Type:
Small organic molecule
Emp. Form.:
C17H15F3O6P2
Mol. Mass.:
434.2423
SMILES:
[O-]P([O-])(=O)C(CCCc1ccc(cc1)-c1ccc(cc1)C(F)(F)F)P([O-])([O-])=O
: