Target
Metabotropic glutamate receptor 4
Ligand
BDBM50293721
Substrate
Meas. Tech.
ChEMBL_571886 (CHEMBL1034756)
EC50
240±n/a nM
Citation
 Engers, DWNiswender, CMWeaver, CDJadhav, SMenon, UNZamorano, RConn, PJLindsley, CWHopkins, CR Synthesis and evaluation of a series of heterobiarylamides that are centrally penetrant metabotropic glutamate receptor 4 (mGluR4) positive allosteric modulators (PAMs). J Med Chem 52:4115-8 (2009)  
Target
Name:
Metabotropic glutamate receptor 4
Synonyms:
GPRC1D GRM4_HUMAN MGLUR4 Metabotropic glutamate receptor 4 (mGlu4) metabotropic glutamate 4
Type:
Protein
Mol. Mass.:
101899.95
Organism:
Homo sapiens (Human)
Description:
Q14833
Residue:
912
  
Inhibitor
Name:
BDBM50293721
Synonyms:
CHEMBL562551 cid_44191096
Type:
Small organic molecule
Emp. Form.:
C13H11ClN2O2
Mol. Mass.:
262.692
SMILES:
COc1cc(NC(=O)c2ccccn2)ccc1Cl
: