Target
DNA (cytosine-5)-methyltransferase 1
Ligand
BDBM50294494
Substrate
Meas. Tech.
ChEMBL_575565 (CHEMBL1036408)
IC50
7400±n/a nM
Citation
 Saavedra, OMIsakovic, LLlewellyn, DBZhan, LBernstein, NClaridge, SRaeppel, FVaisburg, AElowe, NPetschner, AJRahil, JBeaulieu, NMacLeod, ARDelorme, DBesterman, JMWahhab, A SAR around (l)-S-adenosyl-l-homocysteine, an inhibitor of human DNA methyltransferase (DNMT) enzymes. Bioorg Med Chem Lett 19:2747-51 (2009)  
Target
Name:
DNA (cytosine-5)-methyltransferase 1
Synonyms:
AIM CXXC9 DNA (cytosine-5)-methyltransferase 1 isoform b DNA methyltransferase HsaI DNMT1 M.HsaI | MCMT
Type:
Enzyme
Mol. Mass.:
183184.85
Organism:
Homo sapiens (Human)
Description:
P26358
Residue:
1616
  
Inhibitor
Name:
BDBM50294494
Synonyms:
2-amino-4-(((2S,3S,4R,5R)-3,4-dihydroxy-5-(6-(3-phenylpropylamino)-9H-purin-9-yl)-tetrahydrofuran-2-yl)methylthio)butanoic acid | CHEMBL560105
Type:
Small organic molecule
Emp. Form.:
C23H30N6O5S
Mol. Mass.:
502.587
SMILES:
NC(CCSC[C@H]1O[C@H]([C@H](O)[C@@H]1O)n1cnc2c(NCCCc3ccccc3)ncnc12)C(O)=O
: