Target
DNA (cytosine-5)-methyltransferase 3B
Ligand
BDBM50294497
Substrate
Meas. Tech.
ChEMBL_575566 (CHEMBL1036409)
IC50
900±n/a nM
Citation
 Saavedra, OMIsakovic, LLlewellyn, DBZhan, LBernstein, NClaridge, SRaeppel, FVaisburg, AElowe, NPetschner, AJRahil, JBeaulieu, NMacLeod, ARDelorme, DBesterman, JMWahhab, A SAR around (l)-S-adenosyl-l-homocysteine, an inhibitor of human DNA methyltransferase (DNMT) enzymes. Bioorg Med Chem Lett 19:2747-51 (2009)  
Target
Name:
DNA (cytosine-5)-methyltransferase 3B
Synonyms:
DNM3B_HUMAN | DNMT3B
Type:
PROTEIN
Mol. Mass.:
95771.12
Organism:
Homo sapiens (Human)
Description:
ChEMBL_1473708
Residue:
853
  
Inhibitor
Name:
BDBM50294497
Synonyms:
4-(((2S,3S,4R,5R)-5-(6-(3,5-dimethoxybenzylamino)-9H-purin-9-yl)-3,4-dihydroxy-tetrahydrofuran-2-yl)methylthio)-2-aminobutanoic acid | CHEMBL560505
Type:
Small organic molecule
Emp. Form.:
C23H30N6O7S
Mol. Mass.:
534.585
SMILES:
COc1cc(CNc2ncnc3n(cnc23)[C@@H]2O[C@H](CSCCC(N)C(O)=O)[C@@H](O)[C@H]2O)cc(OC)c1
: