Target
DNA (cytosine-5)-methyltransferase 3B
Ligand
BDBM50294556
Substrate
Meas. Tech.
ChEMBL_575600 (CHEMBL1036445)
IC50
27000±n/a nM
Citation
 Isakovic, LSaavedra, OMLlewellyn, DBClaridge, SZhan, LBernstein, NVaisburg, AElowe, NPetschner, AJRahil, JBeaulieu, NGauthier, FMacLeod, ARDelorme, DBesterman, JMWahhab, A Constrained (l-)-S-adenosyl-l-homocysteine (SAH) analogues as DNA methyltransferase inhibitors. Bioorg Med Chem Lett 19:2742-6 (2009)  
Target
Name:
DNA (cytosine-5)-methyltransferase 3B
Synonyms:
DNM3B_HUMAN | DNMT3B
Type:
PROTEIN
Mol. Mass.:
95771.12
Organism:
Homo sapiens (Human)
Description:
ChEMBL_1473708
Residue:
853
  
Inhibitor
Name:
BDBM50294556
Synonyms:
(2S,3R,4S,5S)-2-(6-(2-(biphenyl-4-yl)ethylamino)-2-chloro-9H-purin-9-yl)-5-(((S)-pyrrolidin-3-ylthio)methyl)tetrahydrofuran-3,4-diol | CHEMBL560768
Type:
Small organic molecule
Emp. Form.:
C28H31ClN6O3S
Mol. Mass.:
567.102
SMILES:
O[C@@H]1[C@@H](CS[C@H]2CCNC2)O[C@H]([C@@H]1O)n1cnc2c(NCCc3ccc(cc3)-c3ccccc3)nc(Cl)nc12
: