Target
DNA (cytosine-5)-methyltransferase 1
Ligand
BDBM50294559
Substrate
Meas. Tech.
ChEMBL_575599 (CHEMBL1036444)
IC50
8000±n/a nM
Citation
 Isakovic, LSaavedra, OMLlewellyn, DBClaridge, SZhan, LBernstein, NVaisburg, AElowe, NPetschner, AJRahil, JBeaulieu, NGauthier, FMacLeod, ARDelorme, DBesterman, JMWahhab, A Constrained (l-)-S-adenosyl-l-homocysteine (SAH) analogues as DNA methyltransferase inhibitors. Bioorg Med Chem Lett 19:2742-6 (2009)  
Target
Name:
DNA (cytosine-5)-methyltransferase 1
Synonyms:
AIM CXXC9 DNA (cytosine-5)-methyltransferase 1 isoform b DNA methyltransferase HsaI DNMT1 M.HsaI | MCMT
Type:
Enzyme
Mol. Mass.:
183184.85
Organism:
Homo sapiens (Human)
Description:
P26358
Residue:
1616
  
Inhibitor
Name:
BDBM50294559
Synonyms:
(2S,4S)-4-(((2S,3S,4R,5R)-5-(6-amino-9H-purin-9-yl)-3,4-dihydroxytetrahydrofuran-2-yl)methylthio)piperidine-2-carboxylic acid | CHEMBL550440
Type:
Small organic molecule
Emp. Form.:
C16H22N6O5S
Mol. Mass.:
410.448
SMILES:
Nc1ncnc2n(cnc12)[C@@H]1O[C@H](CS[C@H]2CCN[C@@H](C2)C(O)=O)[C@@H](O)[C@H]1O
: