Target
Cytochrome P450 3A4
Ligand
BDBM22985
Substrate
Meas. Tech.
ChEMBL_579908 (CHEMBL1063294)
IC50
3.499E5±n/a nM
Citation
 Roy, KPratim Roy, P Comparative chemometric modeling of cytochrome 3A4 inhibitory activity of structurally diverse compounds using stepwise MLR, FA-MLR, PLS, GFA, G/PLS and ANN techniques. Eur J Med Chem 44:2913-22 (2009)  
Target
Name:
Cytochrome P450 3A4
Synonyms:
Albendazole monooxygenase CP3A4_HUMAN CYP3A4 CYPIIIA4 Cytochrome P450 3A4 (CYP3A4) Nifedipine oxidase Taurochenodeoxycholate 6-alpha-hydroxylase
Type:
Enzyme
Mol. Mass.:
57349.57
Organism:
Homo sapiens (Human)
Description:
Residue:
503
  
Inhibitor
Name:
BDBM22985
Synonyms:
Aralen CHLOROQUINE PHOSPHATE Chloroquine med.21724, Compound 8 | {4-[(7-chloroquinolin-4-yl)amino]pentyl}diethylamine
Type:
Antimalarial
Emp. Form.:
C18H26ClN3
Mol. Mass.:
319.872
SMILES:
CCN(CC)CCCC(C)Nc1ccnc2cc(Cl)ccc12
: