Target
Hydroxycarboxylic acid receptor 2
Ligand
BDBM23515
Substrate
Meas. Tech.
ChEMBL_579667 (CHEMBL1064087)
EC50
27±n/a nM
Citation
 Skinner, PJWebb, PJSage, CRDang, THPride, CCChen, RTamura, SYRichman, JGConnolly, DTSemple, G 5-N,N-Disubstituted 5-aminopyrazole-3-carboxylic acids are highly potent agonists of GPR109b. Bioorg Med Chem Lett 19:4207-9 (2009)  
Target
Name:
Hydroxycarboxylic acid receptor 2
Synonyms:
G-protein coupled receptor 109A GPR109A HCAR2 HM74A NIACR1 Nicotinic acid receptor 1
Type:
G Protein-Coupled Receptor (GPCR)
Mol. Mass.:
41868.22
Organism:
Homo sapiens (Human)
Description:
Membranes from CHO cells expressing the recombinant human GPR109A were used in competition binding assay.
Residue:
363
  
Inhibitor
Name:
BDBM23515
Synonyms:
CHEMBL573 Nicotinic Acid pyridine-3-carboxylic acid | wampocap
Type:
Small organic molecule
Emp. Form.:
C6H5NO2
Mol. Mass.:
123.1094
SMILES:
OC(=O)c1cccnc1
: