Target
Acyl-CoA desaturase 1
Ligand
BDBM50296309
Substrate
Meas. Tech.
ChEMBL_577393 (CHEMBL1056245)
IC50
0.4±n/a nM
Citation
 Uto, YOgata, TKiyotsuka, YMiyazawa, YUeno, YKurata, HDeguchi, TYamada, MWatanabe, NTakagi, TWakimoto, SOkuyama, RKonishi, MKurikawa, NKono, KOsumi, J Novel and potent inhibitors of stearoyl-CoA desaturase-1. Part II: Identification of 4-ethylamino-3-(2-hydroxyethoxy)-N-[5-(3-trifluoromethylbenzyl)thiazol-2-yl]benzamide and its biological evaluation. Bioorg Med Chem Lett 19:4159-66 (2009)  
Target
Name:
Acyl-CoA desaturase 1
Synonyms:
ACOD1_MOUSE | Scd1
Type:
PROTEIN
Mol. Mass.:
41064.54
Organism:
Mus musculus
Description:
ChEMBL_1462109
Residue:
355
  
Inhibitor
Name:
BDBM50296309
Synonyms:
4-(ethylamino)-3-(2-hydroxyethoxy)-N-(5-(3-(trifluoromethyl)benzyl)thiazol-2-yl)benzamide | CHEMBL564507
Type:
Small organic molecule
Emp. Form.:
C22H22F3N3O3S
Mol. Mass.:
465.489
SMILES:
CCNc1ccc(cc1OCCO)C(=O)Nc1ncc(Cc2cccc(c2)C(F)(F)F)s1
: