Target
Receptor-type tyrosine-protein phosphatase F
Ligand
BDBM50296373
Substrate
Meas. Tech.
ChEMBL_580554 (CHEMBL1054000)
IC50
493±n/a nM
Citation
 Lakshminarayana, NRajendra Prasad, YGharat, LThomas, ARavikumar, PNarayanan, SSrinivasan, CVGopalan, B Synthesis and evaluation of some novel isochroman carboxylic acid derivatives as potential anti-diabetic agents. Eur J Med Chem 44:3147-57 (2009)  
Target
Name:
Receptor-type tyrosine-protein phosphatase F
Synonyms:
LAR Leukocyte common antigen related (LAR) PTPRF_HUMAN Receptor-type tyrosine-protein phosphatase F (LAR)
Type:
Protein
Mol. Mass.:
212869.85
Organism:
Homo sapiens (Human)
Description:
P10586
Residue:
1907
  
Inhibitor
Name:
BDBM50296373
Synonyms:
(3S)-6-[2-(2,2-Dimethyl-1,3-dithiolan-4-yl)ethylcarboxamido]-isochroman-3-carboxylic acid | CHEMBL556076
Type:
Small organic molecule
Emp. Form.:
C18H23NO4S2
Mol. Mass.:
381.51
SMILES:
CC1(C)SCC(CCC(=O)Nc2ccc3CO[C@@H](Cc3c2)C(O)=O)S1
: