Target
Receptor-type tyrosine-protein phosphatase F
Ligand
BDBM50296385
Substrate
Meas. Tech.
ChEMBL_580554 (CHEMBL1054000)
IC50
4072±n/a nM
Citation
 Lakshminarayana, NRajendra Prasad, YGharat, LThomas, ARavikumar, PNarayanan, SSrinivasan, CVGopalan, B Synthesis and evaluation of some novel isochroman carboxylic acid derivatives as potential anti-diabetic agents. Eur J Med Chem 44:3147-57 (2009)  
Target
Name:
Receptor-type tyrosine-protein phosphatase F
Synonyms:
LAR Leukocyte common antigen related (LAR) PTPRF_HUMAN Receptor-type tyrosine-protein phosphatase F (LAR)
Type:
Protein
Mol. Mass.:
212869.85
Organism:
Homo sapiens (Human)
Description:
P10586
Residue:
1907
  
Inhibitor
Name:
BDBM50296385
Synonyms:
(3S)-6-{4-[(4R)-1,3-Dithian-4-yl]butylcarboxamido}-isochroman-3-carboxylic acid | CHEMBL554726
Type:
Small organic molecule
Emp. Form.:
C19H25NO4S2
Mol. Mass.:
395.536
SMILES:
OC(=O)[C@@H]1Cc2cc(NC(=O)CCCC[C@@H]3CCSCS3)ccc2CO1
: