Target
Acyl-CoA desaturase 1
Ligand
BDBM50296522
Substrate
Meas. Tech.
ChEMBL_582072 (CHEMBL1060791)
IC50
1±n/a nM
Citation
 Uto, YOgata, THarada, JKiyotsuka, YUeno, YMiyazawa, YKurata, HDeguchi, TWatanabe, NTakagi, TWakimoto, SOkuyama, RAbe, MKurikawa, NKawamura, SYamato, MOsumi, J Novel and potent inhibitors of stearoyl-CoA desaturase-1. Part I: Discovery of 3-(2-hydroxyethoxy)-4-methoxy-N-[5-(3-trifluoromethylbenzyl)thiazol-2-yl]benzamide. Bioorg Med Chem Lett 19:4151-8 (2009)  
Target
Name:
Acyl-CoA desaturase 1
Synonyms:
ACOD1_MOUSE | Scd1
Type:
PROTEIN
Mol. Mass.:
41064.54
Organism:
Mus musculus
Description:
ChEMBL_1462109
Residue:
355
  
Inhibitor
Name:
BDBM50296522
Synonyms:
CHEMBL561588 | N-(5-(3-chlorobenzyl)thiazol-2-yl)-3-(2-hydroxyethoxy)-4-methoxybenzamide
Type:
Small organic molecule
Emp. Form.:
C20H19ClN2O4S
Mol. Mass.:
418.894
SMILES:
COc1ccc(cc1OCCO)C(=O)Nc1ncc(Cc2cccc(Cl)c2)s1
: