Target
Nociceptin receptor
Ligand
BDBM50296842
Substrate
Meas. Tech.
ChEMBL_582618 (CHEMBL1054181)
IC50
0.25±n/a nM
Citation
 Nishimura, HLi, JIsozaki, KOkada, KMatsushima, ANose, TCosta, TShimohigashi, Y Discriminatory synergistic effect of Trp-substitutions in superagonist [(Arg/Lys)(14), (Arg/Lys)(15)]nociceptin on ORL1 receptor binding and activation. Bioorg Med Chem 17:5683-7 (2009)  
Target
Name:
Nociceptin receptor
Synonyms:
Nociceptin/Orphanin FQ, NOP receptor OPRX_RAT Oprl | Oprl1
Type:
Enzyme Catalytic Domain
Mol. Mass.:
40531.08
Organism:
RAT
Description:
Nociceptin/Orphanin FQ, NOP receptor 0 RAT::P35370
Residue:
367
  
Inhibitor
Name:
BDBM50296842
Synonyms:
CHEMBL559130 | FGGFTGARKSARKWKNQ
Type:
Small organic molecule
Emp. Form.:
C87H135N29O22
Mol. Mass.:
1939.1839
SMILES:
C[C@@H](O)[C@H](NC(=O)[C@H](Cc1ccccc1)NC(=O)CNC(=O)CNC(=O)[C@@H](N)Cc1ccccc1)C(=O)NCC(=O)N[C@@H](C)C(=O)N[C@@H](CCCN=C(N)N)C(=O)N[C@@H](CCCCN)C(=O)N[C@@H](CO)C(=O)N[C@@H](C)C(=O)N[C@@H](CCCN=C(N)N)C(=O)N[C@@H](CCCCN)C(=O)N[C@@H](Cc1c[nH]c2ccccc12)C(=O)N[C@@H](CCCCN)C(=O)N[C@@H](CC(N)=O)C(=O)N[C@@H](CCC(N)=O)C(O)=O
: