Target
Replicase polyprotein 1ab
Ligand
BDBM50297257
Substrate
Meas. Tech.
ChEMBL_581484 (CHEMBL1057306)
IC50
8100±n/a nM
Citation
 Lee, CLee, JMLee, NRKim, DEJeong, YJChong, Y Investigation of the pharmacophore space of Severe Acute Respiratory Syndrome coronavirus (SARS-CoV) NTPase/helicase by dihydroxychromone derivatives. Bioorg Med Chem Lett 19:4538-41 (2009)  
Target
Name:
Replicase polyprotein 1ab
Synonyms:
3C-like proteinase 3C-like proteinase (SARS-CoV 3Cpro) 3CLp GFL Guanine-N7 methyltransferase Helicase Leader protein Non-structural protein 10 Non-structural protein 3 Non-structural protein 6 Non-structural protein 8 ORF1ab polyprotein PL2-PRO Pol R1AB_SARS RdRp SARS coronavirus main proteinase nsp1 nsp12 nsp14 nsp16 nsp3 nsp5 nsp7 nsp9 pp1ab | rep
Type:
Protein
Mol. Mass.:
790250.81
Organism:
Human SARS coronavirus (SARS-CoV) (Severe acute respiratory syndrome coronavirus)
Description:
P0C6X7
Residue:
7073
  
Inhibitor
Name:
BDBM50297257
Synonyms:
3-(2-Benzo[1,3]dioxol-5-yl-3,5-dihydroxy-4-oxo-4H-chromen-7-yloxymethyl)-benzonitrile | CHEMBL551529
Type:
Small organic molecule
Emp. Form.:
C24H15NO7
Mol. Mass.:
429.3784
SMILES:
Oc1cc(OCc2cccc(c2)C#N)cc2oc(c(O)c(=O)c12)-c1ccc2OCOc2c1
: