Target
Cytochrome P450 2C9
Ligand
BDBM50297376
Substrate
Meas. Tech.
ChEMBL_583358 (CHEMBL1053351)
IC50
27±n/a nM
Citation
 Hutchinson, JHLi, YArruda, JMBaccei, CBain, GChapman, CCorrea, LDarlington, JKing, CDLee, CLorrain, DProdanovich, PRong, HSantini, AStock, NPrasit, PEvans, JF 5-lipoxygenase-activating protein inhibitors: development of 3-[3-tert-butylsulfanyl-1-[4-(6-methoxy-pyridin-3-yl)-benzyl]-5-(pyridin-2-ylmethoxy)-1H-indol-2-yl]-2,2-dimethyl-propionic acid (AM103). J Med Chem 52:5803-15 (2009)  
Target
Name:
Cytochrome P450 2C9
Synonyms:
(R)-limonene 6-monooxygenase CP2C9_HUMAN CYP2C9 Cytochrome P450 2C9 (CYP2C9 ) P-450MP P450 PB-1 | S-mephenytoin 4-hydroxylase
Type:
Enzyme
Mol. Mass.:
55636.33
Organism:
Homo sapiens (Human)
Description:
P11712
Residue:
490
  
Inhibitor
Name:
BDBM50297376
Synonyms:
3-(3-(tert-butylthio)-1-(4-(6-methoxypyridazin-3-yl)benzyl)-5-(pyridin-2-ylmethoxy)-1H-indol-2-yl)-2,2-dimethylpropanoic acid | CHEMBL552567
Type:
Small organic molecule
Emp. Form.:
C35H38N4O4S
Mol. Mass.:
610.766
SMILES:
COc1ccc(nn1)-c1ccc(Cn2c(CC(C)(C)C(O)=O)c(SC(C)(C)C)c3cc(OCc4ccccn4)ccc23)cc1
: