Target
Cholinesterase
Ligand
BDBM10620
Substrate
Meas. Tech.
ChEMBL_587744 (CHEMBL1040395)
IC50
170±n/a nM
Citation
 Marcelo, FSilva, FVGoulart, MJustino, JSinaÿ, PBlériot, YRauter, AP Synthesis of novel purine nucleosides towards a selective inhibition of human butyrylcholinesterase. Bioorg Med Chem 17:5106-16 (2009)  
Target
Name:
Cholinesterase
Synonyms:
Acylcholine acylhydrolase Butyrylcholine esterase (BChE) Butyrylcholinesterase (BuChE) CHLE_HUMAN Cholinesterases Pseudocholinesterase
Type:
Homotetramer
Mol. Mass.:
68422.27
Organism:
Homo sapiens (Human)
Description:
P06276
Residue:
602
  
Inhibitor
Name:
BDBM10620
Synonyms:
(S)-3-(1-(dimethylamino)ethyl)phenyl ethyl(methyl)carbamate 3-(1-(dimethylamino)ethyl)phenyl ethyl(methyl)carbamate CHEMBL636 Ethyl-methyl-carbamic acid 3-((R)-1-dimethylamino-ethyl)-phenyl ester Ethyl-methyl-carbamic acid 3-(1-dimethylamino-ethyl)-phenyl ester Rivastigmine SDZ-212-713 | SDZ-ENA-713
Type:
Small organic molecule
Emp. Form.:
C14H22N2O2
Mol. Mass.:
250.3367
SMILES:
[H][C@@](C)(N(C)C)c1cccc(OC(=O)N(C)CC)c1
: