Target
Histone-lysine N-methyltransferase EHMT2
Ligand
BDBM50300034
Substrate
Meas. Tech.
ChEMBL_593233 (CHEMBL1046740)
IC50
1100±n/a nM
Citation
 Liu, FChen, XAllali-Hassani, AQuinn, AMWasney, GADong, ABarsyte, DKozieradzki, ISenisterra, GChau, ISiarheyeva, AKireev, DBJadhav, AHerold, JMFrye, SVArrowsmith, CHBrown, PJSimeonov, AVedadi, MJin, J Discovery of a 2,4-diamino-7-aminoalkoxyquinazoline as a potent and selective inhibitor of histone lysine methyltransferase G9a. J Med Chem 52:7950-3 (2009)  
Target
Name:
Histone-lysine N-methyltransferase EHMT2
Synonyms:
BAT8 EHMT2 G9A Histone-lysine N-methyltransferase EHMT1/EHMT2 KMT1C Protein G9a (G9a)
Type:
Enzyme
Mol. Mass.:
132339.87
Organism:
Homo sapiens (Human)
Description:
Q96KQ7
Residue:
1210
  
Inhibitor
Name:
BDBM50300034
Synonyms:
6,7-Dimethoxy-N2,N2-dimethyl-N4-(1-methylpiperidin-4-yl)-quinazoline-2,4-diamine CHEMBL576260
Type:
Small organic molecule
Emp. Form.:
C18H27N5O2
Mol. Mass.:
345.4393
SMILES:
COc1cc2nc(nc(NC3CCN(C)CC3)c2cc1OC)N(C)C
: