Target
cAMP-specific 3',5'-cyclic phosphodiesterase 7B
Ligand
BDBM50300113
Substrate
Meas. Tech.
ChEMBL_593504 (CHEMBL1047628)
IC50
>1000±n/a nM
Citation
 Verhoest, PRProulx-Lafrance, CCorman, MChenard, LHelal, CJHou, XKleiman, RLiu, SMarr, EMenniti, FSSchmidt, CJVanase-Frawley, MSchmidt, AWWilliams, RDNelson, FRFonseca, KRLiras, S Identification of a brain penetrant PDE9A inhibitor utilizing prospective design and chemical enablement as a rapid lead optimization strategy. J Med Chem 52:7946-9 (2009)  
Target
Name:
cAMP-specific 3',5'-cyclic phosphodiesterase 7B
Synonyms:
3',5'-cyclic phosphodiesterase PDE7B_HUMAN Phosphodiesterase 7B (PDE7B) | cAMP-specific 3',5'-cyclic phosphodiesterase 7B
Type:
Enzyme
Mol. Mass.:
51842.76
Organism:
Homo sapiens (Human)
Description:
Q9NP56
Residue:
450
  
Inhibitor
Name:
BDBM50300113
Synonyms:
1-cyclopentyl-6-[(3S,4S)-4-methyl-1-(quinoxalin-6-ylmethyl)pyrrolidin-3-yl]-1,5-dihydro-4H-pyrazolo[3,4-d]pyrimidin-4-one | CHEMBL583914
Type:
Small organic molecule
Emp. Form.:
C24H27N7O
Mol. Mass.:
429.5175
SMILES:
C[C@@H]1CN(Cc2ccc3nccnc3c2)C[C@H]1c1nc2n(ncc2c(=O)[nH]1)C1CCCC1
: