Target
cGMP-specific 3',5'-cyclic phosphodiesterase
Ligand
BDBM50300964
Substrate
Meas. Tech.
ChEMBL_597959 (CHEMBL1042744)
IC50
0.050000±n/a nM
Citation
 Hughes, ROWalker, JKRogier, DJHeasley, SEBlevis-Bal, RMBenson, AGJacobsen, EJCubbage, JWFobian, YMOwen, DRFreskos, JNMolyneaux, JMBrown, DLAcker, BAMaddux, TMTollefson, MBMoon, JBMischke, BVRumsey, JMZheng, YMacInnes, ABond, BRYu, Y Optimization of the aminopyridopyrazinones class of PDE5 inhibitors: discovery of 3-[(trans-4-hydroxycyclohexyl)amino]-7-(6-methoxypyridin-3-yl)-1-(2-propoxyethyl)pyrido[3,4-b]pyrazin-2(1H)-one. Bioorg Med Chem Lett 19:5209-13 (2009)  
Target
Name:
cGMP-specific 3',5'-cyclic phosphodiesterase
Synonyms:
3',5'-cyclic phosphodiesterase PDE5 PDE5A_HUMAN Phosphodiesterase 5 (PDE5) Phosphodiesterase 5A (PDE5A) cGMP-specific 3',5'-cyclic phosphodiesterase
Type:
Protein
Mol. Mass.:
99975.83
Organism:
Homo sapiens (Human)
Description:
O76074
Residue:
875
  
Inhibitor
Name:
BDBM50300964
Synonyms:
CHEMBL584270 | rac-7-(6-methoxypyridin-3-yl)-1-(2-propoxyethyl)-3-((tetrahydrofuran-2-yl)methylamino)pyrido[3,4-b]pyrazin-2(1H)-one
Type:
Small organic molecule
Emp. Form.:
C23H29N5O4
Mol. Mass.:
439.5075
SMILES:
CCCOCCn1c2cc(ncc2nc(NCC2CCCO2)c1=O)-c1ccc(OC)nc1
: