Target
Beta-1 adrenergic receptor
Ligand
BDBM50301252
Substrate
Meas. Tech.
ChEMBL_599079 (CHEMBL1044605)
EC50
3.4±n/a nM
Citation
 Bouyssou, TRudolf, KHoenke, CLustenberger, PSchnapp, AKonetzki, I Studies towards topical selective beta2-adrenoceptor agonists with a long duration of action. Bioorg Med Chem Lett 19:5237-40 (2009)  
Target
Name:
Beta-1 adrenergic receptor
Synonyms:
ADRB1 ADRB1_HUMAN Beta-1 adrenoceptor | adrenergic Beta1
Type:
G Protein-Coupled Receptor (GPCR)
Mol. Mass.:
51338.40
Organism:
Homo sapiens (Human)
Description:
P08588
Residue:
477
  
Inhibitor
Name:
BDBM50301252
Synonyms:
4-amino-N-(4-(2-(2-hydroxy-2-(5-hydroxy-3-oxo-3,4-dihydro-2H-benzo[b][1,4]oxazin-8-yl)ethylamino)-2-methylpropyl)phenyl)butanamide | CHEMBL577702
Type:
Small organic molecule
Emp. Form.:
C24H32N4O5
Mol. Mass.:
456.5347
SMILES:
CC(C)(Cc1ccc(NC(=O)CCCN)cc1)NCC(O)c1ccc(O)c2NC(=O)COc12
: