Target
Kappa-type opioid receptor
Ligand
BDBM50302757
Substrate
Meas. Tech.
ChEMBL_595268 (CHEMBL1043620)
Ki
453±n/a nM
Citation
 Jones, PGriffin, AMGawell, LLavoie, RDelorme, DRoberts, EBrown, WWalpole, CXiao, WBoulet, JLabarre, MCoupal, MButterworth, JSt-Onge, SHodzic, LSalois, D N,N-Diethyl-4-[(3-hydroxyphenyl)(piperidin-4-yl)amino] benzamide derivatives: the development of diaryl amino piperidines as potent delta opioid receptor agonists with in vivo anti-nociceptive activity in rodent models. Bioorg Med Chem Lett 19:5994-8 (2009)  
Target
Name:
Kappa-type opioid receptor
Synonyms:
K-OR-1 Kappa-opioid receptor (KOR) Kappa-type opioid receptor (KOR) OPIATE Kappa OPRK1 kappa opioid receptor (KOR)
Type:
G Protein-Coupled Receptor (GPCR)
Mol. Mass.:
42648.76
Organism:
Homo sapiens (Human)
Description:
P41145
Residue:
380
  
Inhibitor
Name:
BDBM50302757
Synonyms:
CHEMBL568803 | N,N-diethyl-4-((3-hydroxyphenyl)(1-(2-(thiophen-2-yl)ethyl)piperidin-4-yl)amino)benzamide
Type:
Small organic molecule
Emp. Form.:
C28H35N3O2S
Mol. Mass.:
477.661
SMILES:
CCN(CC)C(=O)c1ccc(cc1)N(C1CCN(CCc2cccs2)CC1)c1cccc(O)c1
: