Target
Dual specificity protein phosphatase 3
Ligand
BDBM11985
Substrate
Meas. Tech.
ChEMBL_595099 (CHEMBL1047959)
Ki
12800±n/a nM
Citation
 Wu, SVossius, SRahmouni, SMiletic, AVVang, TVazquez-Rodriguez, JCerignoli, FArimura, YWilliams, SHayes, TMoutschen, MVasile, SPellecchia, MMustelin, TTautz, L Multidentate small-molecule inhibitors of vaccinia H1-related (VHR) phosphatase decrease proliferation of cervix cancer cells. J Med Chem 52:6716-23 (2009)  
Target
Name:
Dual specificity protein phosphatase 3
Synonyms:
DUS3_HUMAN Dual specificity protein phosphatase (VHR) Dual specificity protein phosphatase VHR Tyrosine-protein phosphatase non-receptor type 1 | VHR
Type:
Hydrolase
Mol. Mass.:
20480.58
Organism:
Homo sapiens (Human)
Description:
Residue:
185
  
Inhibitor
Name:
BDBM11985
Synonyms:
4-(2,5-dimethyl-1H-pyrrol-1-yl)-2-hydroxybenzoic acid chemical diversity library compound 10
Type:
Small organic molecule
Emp. Form.:
C13H13NO3
Mol. Mass.:
231.2472
SMILES:
Cc1ccc(C)n1-c1ccc(C(O)=O)c(O)c1
: