Target
Dual specificity protein phosphatase 3
Ligand
BDBM50303189
Substrate
Meas. Tech.
ChEMBL_595099 (CHEMBL1047959)
Ki
13800±n/a nM
Citation
 Wu, SVossius, SRahmouni, SMiletic, AVVang, TVazquez-Rodriguez, JCerignoli, FArimura, YWilliams, SHayes, TMoutschen, MVasile, SPellecchia, MMustelin, TTautz, L Multidentate small-molecule inhibitors of vaccinia H1-related (VHR) phosphatase decrease proliferation of cervix cancer cells. J Med Chem 52:6716-23 (2009)  
Target
Name:
Dual specificity protein phosphatase 3
Synonyms:
DUS3_HUMAN Dual specificity protein phosphatase (VHR) Dual specificity protein phosphatase VHR Tyrosine-protein phosphatase non-receptor type 1 | VHR
Type:
Hydrolase
Mol. Mass.:
20480.58
Organism:
Homo sapiens (Human)
Description:
Residue:
185
  
Inhibitor
Name:
BDBM50303189
Synonyms:
5,5-dihydroxy-4H-pyrido[3,2,1-jk]carbazole-4,6(5H)-dione | CHEMBL567686
Type:
Small organic molecule
Emp. Form.:
C15H9NO4
Mol. Mass.:
267.2363
SMILES:
OC1(O)C(=O)c2cccc3c4ccccc4n(C1=O)c23
: