Target
Vascular endothelial growth factor receptor 2
Ligand
BDBM50303268
Substrate
Meas. Tech.
ChEMBL_595361 (CHEMBL1050654)
IC50
19±n/a nM
Citation
 Saavedra, OClaridge, SZhan, LRaeppel, FGranger, MCRaeppel, SMannion, MGaudette, FZhou, NIsakovic, LBernstein, NDéziel, RNguyen, HBeaulieu, NBeaulieu, CDupont, IWang, JMacleod, ARBesterman, JMVaisburg, A N3-arylmalonamides: a new series of thieno[3,2-b]pyridine based inhibitors of c-Met and VEGFR2 tyrosine kinases. Bioorg Med Chem Lett 19:6836-9 (2009)  
Target
Name:
Vascular endothelial growth factor receptor 2
Synonyms:
CD_antigen=CD309 Fetal liver kinase 1 (FLK-1) KDR Protein-tyrosine kinase receptor Flk-1 VEGFR-2 VEGFR2 Vascular Endothelial Growth Factor Receptor Kinase 2 Vascular endothelial growth factor receptor 2 (KDR) Vascular endothelial growth factor receptor 2 (VEGFR2) Vascular endothelial growth factor receptor-2 (VEGFR-2)
Type:
Receptor Tyrosine Kinase
Mol. Mass.:
151510.97
Organism:
Homo sapiens (Human)
Description:
P35968
Residue:
1356
  
Inhibitor
Name:
BDBM50303268
Synonyms:
2-(4-(7-(2-fluoro-4-(3-oxo-3-(phenylamino)propanamido)phenoxy)thieno[3,2-b]pyridine-2-carbonyl)-1H-imidazol-1-yl)acetic acid | CHEMBL570869
Type:
Small organic molecule
Emp. Form.:
C28H20FN5O6S
Mol. Mass.:
573.552
SMILES:
OC(=O)Cn1cnc(c1)C(=O)c1cc2nccc(Oc3ccc(NC(=O)CC(=O)Nc4ccccc4)cc3F)c2s1
: