Target
Angiotensin-converting enzyme
Ligand
BDBM50073120
Substrate
Meas. Tech.
ChEMBL_595724 (CHEMBL1045247)
Ki
6±n/a nM
Citation
 Jullien, NMakritis, AGeorgiadis, DBeau, FYiotakis, ADive, V Phosphinic tripeptides as dual angiotensin-converting enzyme C-domain and endothelin-converting enzyme-1 inhibitors. J Med Chem 53:208-20 (2010)  
Target
Name:
Angiotensin-converting enzyme
Synonyms:
ACE Angiotensin converting enzyme (ACE) Angiotensin-converting enzyme, soluble form CD_antigen=CD143 DCP1 Kininase II
Type:
Enzyme
Mol. Mass.:
149709.01
Organism:
Homo sapiens (Human)
Description:
Residue:
1306
  
Inhibitor
Name:
BDBM50073120
Synonyms:
(4S,6S,9aS)-6-((S)-2-Mercapto-3-phenyl-propionylamino)-5-oxo-octahydro-9-thia-4a-aza-benzocycloheptene-4-carboxylic acid BMS-186716 OMAPATRILAT
Type:
Small organic molecule
Emp. Form.:
C19H24N2O4S2
Mol. Mass.:
408.535
SMILES:
OC(=O)[C@@H]1CCC[C@@H]2SCC[C@H](NC(=O)[C@@H](S)Cc3ccccc3)C(=O)N12
: