Target
Caspase-1
Ligand
BDBM50303436
Substrate
Meas. Tech.
ChEMBL_595869 (CHEMBL1040853)
IC50
16218.1±n/a nM
Citation
 Mott, BTFerreira, RSSimeonov, AJadhav, AAng, KKLeister, WShen, MSilveira, JTDoyle, PSArkin, MRMcKerrow, JHInglese, JAustin, CPThomas, CJShoichet, BKMaloney, DJ Identification and optimization of inhibitors of Trypanosomal cysteine proteases: cruzain, rhodesain, and TbCatB. J Med Chem 53:52-60 (2010)  
Target
Name:
Caspase-1
Synonyms:
CASP1 Caspase ICE IL1BCE Interleukin-1 beta-converting enzyme
Type:
Enzyme
Mol. Mass.:
45154.13
Organism:
Homo sapiens (Human)
Description:
P29466
Residue:
404
  
Inhibitor
Name:
BDBM50303436
Synonyms:
9-(2,2-difluoroethyl)-6-(3,5-difluorophenylamino)-9H-purine-2-carbonitrile | CHEMBL578159
Type:
Small organic molecule
Emp. Form.:
C14H8F4N6
Mol. Mass.:
336.2471
SMILES:
FC(F)Cn1cnc2c(Nc3cc(F)cc(F)c3)nc(nc12)C#N
: