Target
Aminopeptidase N
Ligand
BDBM23971
Substrate
Meas. Tech.
ChEMBL_604356 (CHEMBL1068639)
IC50
3600±n/a nM
Citation
 Liu, YShang, LFang, HZhu, HMu, JWang, QWang, XYuan, YXu, W Design, synthesis, and preliminary studies of the activity of novel derivatives of N-cinnamoyl-L-aspartic acid as inhibitors of aminopeptidase N/CD13. Bioorg Med Chem 17:7398-404 (2009)  
Target
Name:
Aminopeptidase N
Synonyms:
AMPN_PIG AP-M Alanyl aminopeptidase Aminopeptidase N (APN) Microsomal aminopeptidase pAPN
Type:
Protein
Mol. Mass.:
108810.25
Organism:
Sus scrofa (Pig)
Description:
P15145
Residue:
963
  
Inhibitor
Name:
BDBM23971
Synonyms:
(2S)-2-[(2S,3R)-3-amino-2-hydroxy-4-phenylbutanamido]-4-methylpentanoic acid CHEMBL29292 | Ubenimex
Type:
Small organic molecule
Emp. Form.:
C16H24N2O4
Mol. Mass.:
308.3728
SMILES:
CC(C)C[C@H](NC(=O)[C@@H](O)[C@H](N)Cc1ccccc1)C(O)=O
: