Target
Lysophosphatidic acid receptor 2
Ligand
BDBM50271701
Substrate
Meas. Tech.
ChEMBL_605120 (CHEMBL1073934)
IC50
355±n/a nM
Citation
 Fells, JITsukahara, RLiu, JTigyi, GParrill, AL Structure-based drug design identifies novel LPA3 antagonists. Bioorg Med Chem 17:7457-64 (2009)  
Target
Name:
Lysophosphatidic acid receptor 2
Synonyms:
EDG4 LPA-2 LPAR2 Lysophosphatidic acid receptor 2 | Lysophosphatidic acid receptor Edg-4
Type:
PROTEIN
Mol. Mass.:
39103.44
Organism:
Homo sapiens (Human)
Description:
ChEMBL_1451385
Residue:
351
  
Inhibitor
Name:
BDBM50271701
Synonyms:
2,6-bis(3-carboxyacrylamido)benzoic acid CHEMBL485119
Type:
Small organic molecule
Emp. Form.:
C15H12N2O8
Mol. Mass.:
348.2644
SMILES:
OC(=O)\C=C\C(=O)Nc1cccc(NC(=O)\C=C\C(O)=O)c1C(O)=O
: