Target
5-hydroxytryptamine receptor 2C
Ligand
BDBM50304801
Substrate
Meas. Tech.
ChEMBL_606255 (CHEMBL1069945)
EC50
1±n/a nM
Citation
 Liu, KKCornelius, PPatterson, TAZeng, YSantucci, STomlinson, EGibbons, CMaurer, TSMarala, RBrown, JKong, JXLee, EWerner, WWenzel, ZVage, C Design and synthesis of orally-active and selective azaindane 5HT2c agonist for the treatment of obesity. Bioorg Med Chem Lett 20:266-71 (2010)  
Target
Name:
5-hydroxytryptamine receptor 2C
Synonyms:
5-HT-2C 5-HT2C-INI 5-HTR2C 5-hydroxytryptamine receptor 2C (5-HT-2C) 5HT-1C HTR1C Serotonin (5-HT3) receptor Serotonin Receptor 2C
Type:
G Protein-Coupled Receptor (GPCR)
Mol. Mass.:
51836.79
Organism:
Homo sapiens (Human)
Description:
P28335
Residue:
458
  
Inhibitor
Name:
BDBM50304801
Synonyms:
(S)-7-(2,5-difluorobenzyloxy)-2-((R)-2-methylpiperazin-1-yl)-6,7-dihydro-5H-cyclopenta[b]pyridine | CHEMBL595645
Type:
Small organic molecule
Emp. Form.:
C20H23F2N3O
Mol. Mass.:
359.4129
SMILES:
C[C@@H]1CNCCN1c1ccc2CC[C@H](OCc3cc(F)ccc3F)c2n1
: