Target
Progesterone receptor
Ligand
BDBM50304978
Substrate
Meas. Tech.
ChEMBL_606889 (CHEMBL1071275)
EC50
0.1±n/a nM
Citation
 Kallander, LSWashburn, DGHoang, THFrazee, JSStoy, PJohnson, LLu, QHammond, MBarton, LSPatterson, JRAzzarano, LMNagilla, RMadauss, KPWilliams, SPStewart, ELDuraiswami, CGrygielko, ETXu, XLaping, NJBray, JDThompson, SK Improving the developability profile of pyrrolidine progesterone receptor partial agonists. Bioorg Med Chem Lett 20:371-4 (2010)  
Target
Name:
Progesterone receptor
Synonyms:
NR3C3 PGR PRGR_HUMAN | progesterone
Type:
Protein
Mol. Mass.:
98979.52
Organism:
Homo sapiens (Human)
Description:
P06401
Residue:
933
  
Inhibitor
Name:
BDBM50304978
Synonyms:
(S)-methyl 3-((3-chloro-4-cyanophenyl)(2-chlorobenzyl)amino)pyrrolidine-1-carboxylate | CHEMBL592510
Type:
Small organic molecule
Emp. Form.:
C20H19Cl2N3O2
Mol. Mass.:
404.29
SMILES:
COC(=O)N1CC[C@@H](C1)N(Cc1ccccc1Cl)c1ccc(C#N)c(Cl)c1
: