Target
Progesterone receptor
Ligand
BDBM50304987
Substrate
Meas. Tech.
ChEMBL_606889 (CHEMBL1071275)
EC50
0.4±n/a nM
Citation
 Kallander, LSWashburn, DGHoang, THFrazee, JSStoy, PJohnson, LLu, QHammond, MBarton, LSPatterson, JRAzzarano, LMNagilla, RMadauss, KPWilliams, SPStewart, ELDuraiswami, CGrygielko, ETXu, XLaping, NJBray, JDThompson, SK Improving the developability profile of pyrrolidine progesterone receptor partial agonists. Bioorg Med Chem Lett 20:371-4 (2010)  
Target
Name:
Progesterone receptor
Synonyms:
NR3C3 PGR PRGR_HUMAN | progesterone
Type:
Protein
Mol. Mass.:
98979.52
Organism:
Homo sapiens (Human)
Description:
P06401
Residue:
933
  
Inhibitor
Name:
BDBM50304987
Synonyms:
(S)-4-((2-bromobenzyl)(1-propionylpyrrolidin-3-yl)amino)-2-chlorobenzonitrile | CHEMBL607030
Type:
Small organic molecule
Emp. Form.:
C21H21BrClN3O
Mol. Mass.:
446.768
SMILES:
CCC(=O)N1CC[C@@H](C1)N(Cc1ccccc1Br)c1ccc(C#N)c(Cl)c1
: