Target
Oxysterols receptor LXR-alpha
Ligand
BDBM50305060
Substrate
Meas. Tech.
ChEMBL_603036 (CHEMBL1047697)
IC50
1.9±n/a nM
Citation
 Bernotas, RCSinghaus, RRKaufman, DHTravins, JMUllrich, JWUnwalla, RQuinet, EEvans, MNambi, POlland, AKauppi, BWilhelmsson, AGoos-Nilsson, AWrobel, J 4-(3-Aryloxyaryl)quinoline sulfones are potent liver X receptor agonists. Bioorg Med Chem Lett 20:209-12 (2010)  
Target
Name:
Oxysterols receptor LXR-alpha
Synonyms:
LXRA Liver X receptor alpha Liver X receptor alpha (NR1H3) NR1H3 Nuclear orphan receptor LXR-alpha | Nuclear receptor subfamily 1 group H member 3
Type:
Enzyme Catalytic Domain
Mol. Mass.:
50403.85
Organism:
Homo sapiens (Human)
Description:
Q13133
Residue:
447
  
Inhibitor
Name:
BDBM50305060
Synonyms:
4-(3-(3-fluoro-5-(methylsulfonyl)phenoxy)phenyl)-3-methyl-8-(trifluoromethyl)quinoline | CHEMBL594175
Type:
Small organic molecule
Emp. Form.:
C24H17F4NO3S
Mol. Mass.:
475.455
SMILES:
Cc1cnc2c(cccc2c1-c1cccc(Oc2cc(F)cc(c2)S(C)(=O)=O)c1)C(F)(F)F
: