Target
Oxysterols receptor LXR-beta
Ligand
BDBM50305077
Substrate
Meas. Tech.
ChEMBL_605983 (CHEMBL1069927)
IC50
2.4±n/a nM
Citation
 Travins, JMBernotas, RCKaufman, DHQuinet, ENambi, PFeingold, IHuselton, CWilhelmsson, AGoos-Nilsson, AWrobel, J 1-(3-Aryloxyaryl)benzimidazole sulfones are liver X receptor agonists. Bioorg Med Chem Lett 20:526-30 (2010)  
Target
Name:
Oxysterols receptor LXR-beta
Synonyms:
LXRB Liver X, LXR beta NR1H2 Nuclear receptor NER Ubiquitously-expressed nuclear receptor
Type:
Enzyme Catalytic Domain
Mol. Mass.:
50978.79
Organism:
Homo sapiens (Human)
Description:
P55055
Residue:
460
  
Inhibitor
Name:
BDBM50305077
Synonyms:
3-methyl-4-(3-(3-(methylsulfonyl)phenoxy)phenyl)-8-(trifluoromethyl)quinoline | CHEMBL595689
Type:
Small organic molecule
Emp. Form.:
C24H18F3NO3S
Mol. Mass.:
457.465
SMILES:
Cc1cnc2c(cccc2c1-c1cccc(Oc2cccc(c2)S(C)(=O)=O)c1)C(F)(F)F
: