Target
Vascular endothelial growth factor receptor 2
Ligand
BDBM50306503
Substrate
Meas. Tech.
ChEMBL_610267 (CHEMBL1067992)
IC50
10±n/a nM
Citation
 Gaudette, FRaeppel, SNguyen, HBeaulieu, NBeaulieu, CDupont, IMacleod, ARBesterman, JMVaisburg, A Identification of potent and selective VEGFR receptor tyrosine kinase inhibitors having new amide isostere headgroups. Bioorg Med Chem Lett 20:848-52 (2010)  
Target
Name:
Vascular endothelial growth factor receptor 2
Synonyms:
CD_antigen=CD309 Fetal liver kinase 1 (FLK-1) KDR Protein-tyrosine kinase receptor Flk-1 VEGFR-2 VEGFR2 Vascular Endothelial Growth Factor Receptor Kinase 2 Vascular endothelial growth factor receptor 2 (KDR) Vascular endothelial growth factor receptor 2 (VEGFR2) Vascular endothelial growth factor receptor-2 (VEGFR-2)
Type:
Receptor Tyrosine Kinase
Mol. Mass.:
151510.97
Organism:
Homo sapiens (Human)
Description:
P35968
Residue:
1356
  
Inhibitor
Name:
BDBM50306503
Synonyms:
4,4,4-trifluoro-3-(3-fluoro-4-(2-(1-methyl-1H-imidazol-4-yl)thieno[3,2-b]pyridin-7-yloxy)phenylamino)-N-phenylbutanamide | CHEMBL602703
Type:
Small organic molecule
Emp. Form.:
C27H21F4N5O2S
Mol. Mass.:
555.547
SMILES:
Cn1cnc(c1)-c1cc2nccc(Oc3ccc(NC(CC(=O)Nc4ccccc4)C(F)(F)F)cc3F)c2s1
: