Target
Sodium-dependent serotonin transporter
Ligand
BDBM50154365
Substrate
Meas. Tech.
ChEMBL_607219 (CHEMBL1068051)
Ki
0.171±n/a nM
Citation
 Mavel, SMeheux, NGuilloteau, DEmond, P Synthesis and in vitro evaluation of fluorinated diphenyloxide derivatives and sulfur analogs as serotonin transporter ligands. Bioorg Med Chem 18:236-41 (2010)  
Target
Name:
Sodium-dependent serotonin transporter
Synonyms:
5-HT Transporter 5HTT SC6A4_HUMAN SLC6A4 Serotonin transporter (5HTT) Sodium-dependent serotonin transporter (SERT) | Solute carrier family 6 member 4
Type:
Multi-pass membrane protein
Mol. Mass.:
70322.51
Organism:
Homo sapiens (Human)
Description:
P31645
Residue:
630
  
Inhibitor
Name:
BDBM50154365
Synonyms:
2-(2-((dimethylamino)methyl)phenoxy)-5-iodoaniline CHEMBL186962
Type:
Small organic molecule
Emp. Form.:
C15H17IN2O
Mol. Mass.:
368.2128
SMILES:
CN(C)Cc1ccccc1Oc1ccc(I)cc1N
: