Target
Tyrosine-protein phosphatase non-receptor type 1
Ligand
BDBM50308836
Substrate
Meas. Tech.
ChEMBL_607676 (CHEMBL1071696)
IC50
4100±n/a nM
Citation
 Combs, AP Recent advances in the discovery of competitive protein tyrosine phosphatase 1B inhibitors for the treatment of diabetes, obesity, and cancer. J Med Chem 53:2333-44 (2010)  
Target
Name:
Tyrosine-protein phosphatase non-receptor type 1
Synonyms:
PTN1_HUMAN PTPN1 Protein tyrosine phosphatase-1B (PTP1B) Protein-tyrosine phosphatase 1B (PTP1B) Tyrosine-protein phosphatase non-receptor type 1 (PTP1B)
Type:
Protein phosphatase
Mol. Mass.:
49963.76
Organism:
Homo sapiens (Human)
Description:
Human recombinant GST-fusion PTP1B (1-435).
Residue:
435
  
Inhibitor
Name:
BDBM50308836
Synonyms:
3-(3-Chloro-phenyl)-5-[1-(4-hydroxy-3-methoxy-5-nitro-phenyl)-methylidene]-2-thioxo-thiazolidin-4-one | CHEMBL601733
Type:
Small organic molecule
Emp. Form.:
C17H11ClN2O5S2
Mol. Mass.:
422.863
SMILES:
COc1cc(\C=C2/SC(=S)N(C2=O)c2cccc(Cl)c2)cc(c1O)[N+]([O-])=O
: