Target
Alkaline phosphatase, germ cell type
Ligand
BDBM41888
Substrate
Meas. Tech.
ChEMBL_610126 (CHEMBL1074491)
IC50
1700±n/a nM
Citation
 Lanier, MSergienko, ESimão, AMSu, YChung, TMillán, JLCashman, JR Design and synthesis of selective inhibitors of placental alkaline phosphatase. Bioorg Med Chem 18:573-9 (2010)  
Target
Name:
Alkaline phosphatase, germ cell type
Synonyms:
ALPG ALPPL2 PPBN_HUMAN | placental-like alkaline phosphatase preproprotein
Type:
PROTEIN
Mol. Mass.:
57374.31
Organism:
Homo sapiens (Human)
Description:
ChEMBL_29964
Residue:
532
  
Inhibitor
Name:
BDBM41888
Synonyms:
1-(3,4-dihydroxyphenyl)-2-(2-ethyl-1-imidazolyl)ethanone;hydrochloride 1-[3,4-bis(oxidanyl)phenyl]-2-(2-ethylimidazol-1-yl)ethanone;hydrochloride ML095 cid_25067483
Type:
Small organic molecule
Emp. Form.:
C13H14N2O3
Mol. Mass.:
246.2619
SMILES:
CCc1nccn1CC(=O)c1ccc(O)c(O)c1
: