Target
Telomerase reverse transcriptase
Ligand
BDBM50155645
Substrate
Meas. Tech.
ChEMBL_622825 (CHEMBL1105835)
IC50
600±n/a nM
Citation
 Castillo-González, DCabrera-Pérez, MAPérez-González, MMorales Helguera, ADurán-Martínez, A Prediction of telomerase inhibitory activity for acridinic derivatives based on chemical structure. Eur J Med Chem 44:4826-40 (2009)  
Target
Name:
Telomerase reverse transcriptase
Synonyms:
EST2 TERT TRT
Type:
PROTEIN
Mol. Mass.:
127099.03
Organism:
Homo sapiens (Human)
Description:
ChEMBL_1447029
Residue:
1132
  
Inhibitor
Name:
BDBM50155645
Synonyms:
3-Dimethylamino-N-[7-(3-dimethylamino-propionylamino)-9-oxo-9,10-dihydro-acridin-2-yl]-propionamide CHEMBL186971
Type:
Small organic molecule
Emp. Form.:
C23H29N5O3
Mol. Mass.:
423.5081
SMILES:
CN(C)CCC(=O)Nc1ccc2nc3ccc(NC(=O)CCN(C)C)cc3c(O)c2c1
: