Target
Telomerase reverse transcriptase
Ligand
BDBM50134009
Substrate
Meas. Tech.
ChEMBL_622825 (CHEMBL1105835)
IC50
60±n/a nM
Citation
 Castillo-González, DCabrera-Pérez, MAPérez-González, MMorales Helguera, ADurán-Martínez, A Prediction of telomerase inhibitory activity for acridinic derivatives based on chemical structure. Eur J Med Chem 44:4826-40 (2009)  
Target
Name:
Telomerase reverse transcriptase
Synonyms:
EST2 TERT TRT
Type:
PROTEIN
Mol. Mass.:
127099.03
Organism:
Homo sapiens (Human)
Description:
ChEMBL_1447029
Residue:
1132
  
Inhibitor
Name:
BDBM50134009
Synonyms:
CHEMBL335132 N-[9-(3-Dimethylamino-propylamino)-6-(3-pyrrolidin-1-yl-propionylamino)-acridin-3-yl]-3-pyrrolidin-1-yl-propionamide
Type:
Small organic molecule
Emp. Form.:
C32H45N7O2
Mol. Mass.:
559.7454
SMILES:
CN(C)CCCNc1c2ccc(NC(=O)CCN3CCCC3)cc2nc2cc(NC(=O)CCN3CCCC3)ccc12
: