Target
Telomerase reverse transcriptase
Ligand
BDBM50134005
Substrate
Meas. Tech.
ChEMBL_622825 (CHEMBL1105835)
IC50
570±n/a nM
Citation
 Castillo-González, DCabrera-Pérez, MAPérez-González, MMorales Helguera, ADurán-Martínez, A Prediction of telomerase inhibitory activity for acridinic derivatives based on chemical structure. Eur J Med Chem 44:4826-40 (2009)  
Target
Name:
Telomerase reverse transcriptase
Synonyms:
EST2 TERT TRT
Type:
PROTEIN
Mol. Mass.:
127099.03
Organism:
Homo sapiens (Human)
Description:
ChEMBL_1447029
Residue:
1132
  
Inhibitor
Name:
BDBM50134005
Synonyms:
CHEMBL137928 N-[9-(2-Dimethylamino-ethylamino)-7-(3-pyrrolidin-1-yl-propionylamino)-acridin-2-yl]-3-pyrrolidin-1-yl-propionamide
Type:
Small organic molecule
Emp. Form.:
C31H43N7O2
Mol. Mass.:
545.7188
SMILES:
CN(C)CCNc1c2cc(NC(=O)CCN3CCCC3)ccc2nc2ccc(NC(=O)CCN3CCCC3)cc12
: