Target
Histone-arginine methyltransferase CARM1
Ligand
BDBM27641
Substrate
Meas. Tech.
ChEMBL_618689 (CHEMBL1102467)
IC50
60±n/a nM
Citation
 Therrien, ELarouche, GManku, SAllan, MNguyen, NStyhler, SRobert, MFGoulet, ACBesterman, JMNguyen, HWahhab, A 1,2-Diamines as inhibitors of co-activator associated arginine methyltransferase 1 (CARM1). Bioorg Med Chem Lett 19:6725-32 (2009)  
Target
Name:
Histone-arginine methyltransferase CARM1
Synonyms:
CARM1_MOUSE Coactivator-associated arginine methyltransferase 1 Prmt4 | Protein arginine N-methyltransferase 4
Type:
Homodimer; chromatin regulator; methyltransferase
Mol. Mass.:
65855.95
Organism:
Mus musculus (mouse)
Description:
Assays were using N-terminal His-tagged, recombinant mouse CARM1 (expressed in Sf9 cells and purified using Ni-NTA agarose chromatography).
Residue:
608
  
Inhibitor
Name:
BDBM27641
Synonyms:
1-(3-{[(2S)-2-aminopropanamido]methyl}phenyl)-N-[(2-methoxyphenyl)methyl]-3-(trifluoromethyl)-1H-pyrazole-5-carboxamide | pyrazole scaffold, 1b
Type:
Small organic molecule
Emp. Form.:
C23H24F3N5O3
Mol. Mass.:
475.4636
SMILES:
COc1ccccc1CNC(=O)c1cc(nn1-c1cccc(CNC(=O)[C@H](C)N)c1)C(F)(F)F
: