Target
Amine oxidase [flavin-containing] A
Ligand
BDBM15613
Substrate
Meas. Tech.
ChEMBL_619726 (CHEMBL1111190)
IC50
361380±n/a nM
Citation
 Chimenti, FCarradori, SSecci, DBolasco, ABizzarri, BChimenti, PGranese, AYáñez, MOrallo, F Synthesis and inhibitory activity against human monoamine oxidase of N1-thiocarbamoyl-3,5-di(hetero)aryl-4,5-dihydro-(1H)-pyrazole derivatives. Eur J Med Chem 45:800-4 (2010)  
Target
Name:
Amine oxidase [flavin-containing] A
Synonyms:
AOFA_HUMAN MAO-A Monoamine oxidase Monoamine oxidase type A (MAO A) Monoamine oxidase type A (MAOA)
Type:
Protein
Mol. Mass.:
59689.53
Organism:
Homo sapiens (Human)
Description:
P21397
Residue:
527
  
Inhibitor
Name:
BDBM15613
Synonyms:
4-chloro-N-(2-morpholin-4-ylethyl)benzamide Aurorix MCL | Moclobemide
Type:
Small organic molecule
Emp. Form.:
C13H17ClN2O2
Mol. Mass.:
268.739
SMILES:
Clc1ccc(cc1)C(=O)NCCN1CCOCC1
: