Target
Carboxylic ester hydrolase
Ligand
BDBM50313187
Substrate
Meas. Tech.
ChEMBL_616823 (CHEMBL1100207)
IC50
88.7±n/a nM
Citation
 Zhan, ZJBian, HLWang, JWShan, WG Synthesis of physostigmine analogues and evaluation of their anticholinesterase activities. Bioorg Med Chem Lett 20:1532-4 (2010)  
Target
Name:
Carboxylic ester hydrolase
Synonyms:
Acetylcholinesterase and butyrylcholinesterase (AChE and BChE) Butyrylcholinesterase (BuChE) | butyrylcholinesterase precursor
Type:
Enzyme
Mol. Mass.:
67776.22
Organism:
Rattus norvegicus (rat)
Description:
Residue:
597
  
Inhibitor
Name:
BDBM50313187
Synonyms:
1,3alpha,8-trimethyl-1,2,3,3alpha,8,8alpha-hexahydropyrrolo[2,3-b]indol-5-yl-2-chlorophenylcarbamate | CHEMBL1081473
Type:
Small organic molecule
Emp. Form.:
C20H22ClN3O2
Mol. Mass.:
371.861
SMILES:
CN1CC[C@]2(C)[C@H]1N(C)c1ccc(OC(=O)Nc3ccccc3Cl)cc21
: